Reaction Details
TargetDelta-type opioid receptor
LigandBDBM50374641
Substrate/Competitorn/a
Meas. Tech.ChEMBL_469678 (CHEMBL946806)
Ki>1000±n/a nM
Citation Munro, TADuncan, KKXu, WWang, YLiu-Chen, LYCarlezon, WACohen, BMBéguin, C Standard protecting groups create potent and selective kappa opioids: salvinorin B alkoxymethyl ethers. Bioorg Med Chem16:1279-86 (2008) 
 
Delta-type opioid receptor
Name:Delta-type opioid receptor
Type:Enzyme Catalytic Domain
Mol. Mass.:40577.25
Organism:MOUSE
Description:P32300
Residue:372
BDBM50374641
NameBDBM50374641
Synonyms:CHEMBL270844
TypeSmall organic molecule
Emp. Form.C22H27FO7
Mol. Mass.422.444
SMILESCOC(=O)[C@@H]1C[C@H](OCF)C(=O)[C@H]2[C@@]1(C)CC[C@H]1C(=O)O[C@@H](C[C@]21C)c1ccoc1