Reaction Details
TargetDelta-type opioid receptor
LigandBDBM50374631
Substrate/Competitorn/a
Meas. Tech.ChEMBL_469678 (CHEMBL946806)
Ki>1000±n/a nM
Citation Munro, TADuncan, KKXu, WWang, YLiu-Chen, LYCarlezon, WACohen, BMBéguin, C Standard protecting groups create potent and selective kappa opioids: salvinorin B alkoxymethyl ethers. Bioorg Med Chem16:1279-86 (2008) 
 
Delta-type opioid receptor
Name:Delta-type opioid receptor
Type:Enzyme Catalytic Domain
Mol. Mass.:40577.25
Organism:MOUSE
Description:P32300
Residue:372
BDBM50374631
NameBDBM50374631
Synonyms:CHEMBL403658
TypeSmall organic molecule
Emp. Form.C23H30O7S
Mol. Mass.450.545
SMILESCOC(=O)[C@@H]1C[C@H](OCSC)C(=O)[C@H]2[C@@]1(C)CC[C@H]1C(=O)O[C@@H](C[C@]21C)c1ccoc1