Reaction Details
TargetCasein kinase II subunit alpha
LigandBDBM50374657
Substrate/Competitorn/a
Meas. Tech.ChEMBL_469783 (CHEMBL947049)
Ki 3.4±n/a nM
Citation Nie, ZPerretta, CErickson, PMargosiak, SLu, JAverill, AAlmassy, RChu, S Structure-based design and synthesis of novel macrocyclic pyrazolo[1,5-a] [1,3,5]triazine compounds as potent inhibitors of protein kinase CK2 and their anticancer activities. Bioorg Med Chem Lett18:619-23 (2008) 
 
Casein kinase II subunit alpha
Name:Casein kinase II subunit alpha
Type:Enzyme
Mol. Mass.:39238.74
Organism:Zea mays (Maize)
Description:n/a
Residue:332
BDBM50374657
NameBDBM50374657
Synonyms:CHEMBL257736
TypeSmall organic molecule
Emp. Form.C30H35N9O2
Mol. Mass.553.658
SMILESCCN(CC)C1CN(C1)C(=O)c1cccc(Nc2nc3Nc4cccc(NC(=O)CCCCc5cnn2c5n3)c4)c1