Reaction Details
TargetNitric oxide synthase, inducible
LigandBDBM50374676
Substrate/Competitorn/a
Meas. Tech.ChEMBL_469819 (CHEMBL933386)
Kd 29000±n/a nM
Citation Martin, NIBeeson, WTWoodward, JJMarletta, MA N(G)-aminoguanidines from primary amines and the preparation of nitric oxide synthase inhibitors. J Med Chem51:924-31 (2008) 
 
Nitric oxide synthase, inducible
Name:Nitric oxide synthase, inducible
Type:Homodimer
Mol. Mass.:131141.95
Organism:Homo sapiens (Human)
Description:P35228
Residue:1153
BDBM50374676
NameBDBM50374676
Synonyms:CHEMBL272814
TypeSmall organic molecule
Emp. Form.C7H17N5O2
Mol. Mass.203.2422
SMILESCNNC(=N)NCCC[C@H](N)C(O)=O