Reaction Details
TargetNitric oxide synthase, inducible
LigandBDBM50374677
Substrate/Competitorn/a
Meas. Tech.ChEMBL_469820 (CHEMBL933387)
Ki 2200±n/a nM
Citation Martin, NIBeeson, WTWoodward, JJMarletta, MA N(G)-aminoguanidines from primary amines and the preparation of nitric oxide synthase inhibitors. J Med Chem51:924-31 (2008) 
 
Nitric oxide synthase, inducible
Name:Nitric oxide synthase, inducible
Type:Homodimer
Mol. Mass.:131141.95
Organism:Homo sapiens (Human)
Description:P35228
Residue:1153
BDBM50374677
NameBDBM50374677
Synonyms:CHEMBL405231
TypeSmall organic molecule
Emp. Form.C6H15N5O2
Mol. Mass.189.2156
SMILESNNC(=N)NCCC[C@H](N)C(O)=O