Reaction Details
TargetMAP kinase-activated protein kinase 2
LigandBDBM50374686
Substrate/Competitorn/a
Meas. Tech.ChEMBL_469831 (CHEMBL949020)
IC50 9±n/a nM
Citation Goldberg, DRChoi, YCogan, DCorson, MDeLeon, RGao, AGruenbaum, LHao, MHJoseph, DKashem, MAMiller, CMoss, NNetherton, MRPargellis, CPPelletier, JSellati, RSkow, DTorcellini, CTseng, YCWang, JWasti, RWerneburg, BWu, JPXiong, Z Pyrazinoindolone inhibitors of MAPKAP-K2. Bioorg Med Chem Lett18:938-41 (2008) 
 
MAP kinase-activated protein kinase 2
Name:MAP kinase-activated protein kinase 2
Type:Serine/threonine-protein kinase
Mol. Mass.:45579.87
Organism:Homo sapiens (Human)
Description:P49137
Residue:400
BDBM50374686
NameBDBM50374686
Synonyms:CHEMBL403286
TypeSmall organic molecule
Emp. Form.C29H30N6O3S
Mol. Mass.542.652
SMILESCC1CNC(=O)c2cc3ccc(cc3n12)C(=O)Nc1nc(cs1)C(=O)NC1CCN(Cc2ccccc2)CC1