Reaction Details
TargetMitogen-activated protein kinase 14
LigandBDBM13533
Substrate/Competitorn/a
Meas. Tech.ChEMBL_470044 (CHEMBL933319)
IC50 44±n/a nM
Citation Montalban, AGBoman, EChang, CDCeide, SCDahl, RDalesandro, DDelaet, NGErb, EErnst, JTGibbs, AKahl, JKessler, LLundström, JMiller, SNakanishi, HRoberts, ESaiah, ESullivan, RWang, ZLarson, CJ The design and synthesis of novel alpha-ketoamide-based p38 MAP kinase inhibitors. Bioorg Med Chem Lett18:1772-7 (2008) 
 
Mitogen-activated protein kinase 14
Name:Mitogen-activated protein kinase 14
Type:Serine/threonine-protein kinase
Mol. Mass.:41286.76
Organism:Homo sapiens (Human)
Description:Q16539
Residue:360
BDBM13533
NameBDBM13533
Synonyms:1-[2-(4-methylphenyl)-5-tert-butyl-pyrazol-3-yl]-3-[4-(2-morpholin-4-ylethoxy)naphthalen-1-yl]urea 1-[5-tert-butyl-2-(4-methylphenyl)pyrazol-3-yl]-3-[4-(2-morpholin-4-ylethoxy)naphthalen-1-yl]urea 3-[2-(4-methylphenyl)-5-tert-butyl-pyrazol-3-yl]-1-[4-(2-morpholin-4-ylethoxy)naphthalen-1-yl]urea BIRB 796 BIRB-796, 3 D3RKN_73 US11407771, Compound 43 US9187470, 43 (BIRB-796) US9260410, BIRB796 diaryl urea compound 10
TypeSmall organic molecule
Emp. Form.C31H37N5O3
Mol. Mass.527.6572
SMILESCc1ccc(cc1)-n1nc(cc1NC(=O)Nc1ccc(OCCN2CCOCC2)c2ccccc12)C(C)(C)C