Reaction Details
TargetCoagulation factor X
LigandBDBM50374873
Substrate/Competitorn/a
Meas. Tech.ChEMBL_470061 (CHEMBL933439)
Ki 0.13±n/a nM
Citation Smallheer, JMWang, SLaws, MLNakajima, SHu, ZHan, WJacobson, ILuettgen, JMRossi, KARendina, ARKnabb, RMWexler, RRLam, PYQuan, ML Sulfonamidolactam inhibitors of coagulation factor Xa. Bioorg Med Chem Lett18:2428-33 (2008) 
 
Coagulation factor X
Name:Coagulation factor X
Type:Enzyme
Mol. Mass.:54726.60
Organism:Homo sapiens (Human)
Description:n/a
Residue:488
BDBM50374873
NameBDBM50374873
Synonyms:CHEMBL442457
TypeSmall organic molecule
Emp. Form.C25H21ClN4O6S2
Mol. Mass.573.04
SMILESOC(=O)CN(C1CCCN(C1=O)c1ccc(cc1)-n1ccccc1=O)S(=O)(=O)c1cc2ccc(Cl)nc2s1