Reaction Details
TargetCoagulation factor X
LigandBDBM50374889
Substrate/Competitorn/a
Meas. Tech.ChEMBL_470061 (CHEMBL933439)
Ki 0.43±n/a nM
Citation Smallheer, JMWang, SLaws, MLNakajima, SHu, ZHan, WJacobson, ILuettgen, JMRossi, KARendina, ARKnabb, RMWexler, RRLam, PYQuan, ML Sulfonamidolactam inhibitors of coagulation factor Xa. Bioorg Med Chem Lett18:2428-33 (2008) 
 
Coagulation factor X
Name:Coagulation factor X
Type:Enzyme
Mol. Mass.:54726.60
Organism:Homo sapiens (Human)
Description:n/a
Residue:488
BDBM50374889
NameBDBM50374889
Synonyms:CHEMBL402828
TypeSmall organic molecule
Emp. Form.C36H38ClFN4O6S2
Mol. Mass.741.292
SMILESCN(C1CCN(C)CC1)C(=O)N(C1CCCN(C1=O)c1ccc(cc1F)-c1ccccc1S(C)(=O)=O)S(=O)(=O)c1ccc2cc(Cl)ccc2c1