Reaction Details
TargetCoagulation factor X
LigandBDBM50374894
Substrate/Competitorn/a
Meas. Tech.ChEMBL_470061 (CHEMBL933439)
Ki 2.3±n/a nM
Citation Smallheer, JMWang, SLaws, MLNakajima, SHu, ZHan, WJacobson, ILuettgen, JMRossi, KARendina, ARKnabb, RMWexler, RRLam, PYQuan, ML Sulfonamidolactam inhibitors of coagulation factor Xa. Bioorg Med Chem Lett18:2428-33 (2008) 
 
Coagulation factor X
Name:Coagulation factor X
Type:Enzyme
Mol. Mass.:54726.60
Organism:Homo sapiens (Human)
Description:n/a
Residue:488
BDBM50374894
NameBDBM50374894
Synonyms:CHEMBL256890
TypeSmall organic molecule
Emp. Form.C31H30ClFN2O6S2
Mol. Mass.645.161
SMILESCS(=O)(=O)c1ccccc1-c1ccc(N2CCCC(N(CCCO)S(=O)(=O)c3ccc4cc(Cl)ccc4c3)C2=O)c(F)c1