Reaction Details
TargetCoagulation factor X
LigandBDBM50374900
Substrate/Competitorn/a
Meas. Tech.ChEMBL_470061 (CHEMBL933439)
Ki 5.3±n/a nM
Citation Smallheer, JMWang, SLaws, MLNakajima, SHu, ZHan, WJacobson, ILuettgen, JMRossi, KARendina, ARKnabb, RMWexler, RRLam, PYQuan, ML Sulfonamidolactam inhibitors of coagulation factor Xa. Bioorg Med Chem Lett18:2428-33 (2008) 
 
Coagulation factor X
Name:Coagulation factor X
Type:Enzyme
Mol. Mass.:54726.60
Organism:Homo sapiens (Human)
Description:n/a
Residue:488
BDBM50374900
NameBDBM50374900
Synonyms:CHEMBL402064
TypeSmall organic molecule
Emp. Form.C22H20ClFN2O5S3
Mol. Mass.543.051
SMILESCS(=O)(=O)c1ccccc1-c1ccc(N2CCCC(NS(=O)(=O)c3ccc(Cl)s3)C2=O)c(F)c1