Reaction Details
TargetCoagulation factor X
LigandBDBM50374920
Substrate/Competitorn/a
Meas. Tech.ChEMBL_470061 (CHEMBL933439)
Ki 420±n/a nM
Citation Smallheer, JMWang, SLaws, MLNakajima, SHu, ZHan, WJacobson, ILuettgen, JMRossi, KARendina, ARKnabb, RMWexler, RRLam, PYQuan, ML Sulfonamidolactam inhibitors of coagulation factor Xa. Bioorg Med Chem Lett18:2428-33 (2008) 
 
Coagulation factor X
Name:Coagulation factor X
Type:Enzyme
Mol. Mass.:54726.60
Organism:Homo sapiens (Human)
Description:n/a
Residue:488
BDBM50374920
NameBDBM50374920
Synonyms:CHEMBL257241
TypeSmall organic molecule
Emp. Form.C25H22FN3O5S2
Mol. Mass.527.588
SMILESCS(=O)(=O)c1ccccc1-c1ccc(N2CCCC(NS(=O)(=O)c3ccc(cc3)C#N)C2=O)c(F)c1