Reaction Details
TargetIntegrin alpha-4/beta-1
LigandBDBM50374935
Substrate/Competitorn/a
Meas. Tech.ChEMBL_470071 (CHEMBL933449)
IC50>20000±n/a nM
Citation Harriman, GCBrewer, MBennett, RKuhn, CBazin, MLarosa, GSkerker, PCochran, NGallant, DBaxter, DPicarella, DJaffee, BLuly, JRBriskin, MJ Selective cell adhesion inhibitors: Barbituric acid based alpha4beta7--MAdCAM inhibitors. Bioorg Med Chem Lett18:2509-12 (2008) 
 
Integrin alpha-4/beta-1
Name:Integrin alpha-4/beta-1
Type:n/a
Mol. Mass.:n/a
Description:ASSAY_ID of EBI is 88912
Components:This complex has 2 components.
Component 1
Name:Integrin beta-1
Synonyms:CD_antigen=CD29 Fibronectin receptor beta GPIIA ITGB1 MDF2 | MSK12
Type:Enzyme
Mol. Mass.:88400.38
Organism:Homo sapiens (Human)
Description:P05556
Residue:798
Component 2
Name:Integrin alpha-4
Synonyms:CD49 antigen-like family member D CD49d antigen ITA4_HUMAN Integrin alpha-4 Integrin alpha-IV VLA-4 integrin alpha 4 precursor | integrin alpha-4 precursor
Type:Membrane Protein
Mol. Mass.:114897.35
Organism:Homo sapiens (Human)
Description:P13612
Residue:1032
BDBM50374935
NameBDBM50374935
Synonyms:CHEMBL271052
TypeSmall organic molecule
Emp. Form.C15H10N2O4
Mol. Mass.282.2509
SMILESO=C1NC(=O)\C(=C\c2ccco2)C(=O)N1c1ccccc1