Reaction Details
TargetC-X-C chemokine receptor type 3
LigandBDBM50375120
Substrate/Competitorn/a
Meas. Tech.ChEMBL_470260 (CHEMBL950215)
IC50 40±n/a nM
Citation Hayes, MEBreinlinger, ECWallace, GAGrongsaard, PMiao, WMcPherson, MJStoffel, RHGreen, DWRoth, GP Lead identification of 2-iminobenzimidazole antagonists of the chemokine receptor CXCR3. Bioorg Med Chem Lett18:2414-9 (2008) 
 
C-X-C chemokine receptor type 3
Name:C-X-C chemokine receptor type 3
Type:PROTEIN
Mol. Mass.:41020.84
Organism:Mus musculus
Description:ChEMBL_560734
Residue:367
BDBM50375120
NameBDBM50375120
Synonyms:CHEMBL403040
TypeSmall organic molecule
Emp. Form.C31H27Cl2N5O2
Mol. Mass.572.484
SMILESClc1ccc(cc1)C(=O)Cn1c2cccc(Cl)c2n(CC[C@@H]2CCCN2C(=O)c2cccc3cccnc23)c1=N