Reaction Details
TargetMacrophage colony-stimulating factor 1 receptor
LigandBDBM50375154
Substrate/Competitorn/a
Meas. Tech.ChEMBL_470263 (CHEMBL950218)
IC50 1100±n/a nM
Citation Huang, HHutta, DAHu, HDesJarlais, RLSchubert, CPetrounia, IPChaikin, MAManthey, CLPlayer, MR Design and synthesis of a pyrido[2,3-d]pyrimidin-5-one class of anti-inflammatory FMS inhibitors. Bioorg Med Chem Lett18:2355-61 (2008) 
 
Macrophage colony-stimulating factor 1 receptor
Name:Macrophage colony-stimulating factor 1 receptor
Type:Protein
Mol. Mass.:107979.48
Organism:Homo sapiens (Human)
Description:P07333
Residue:972
BDBM50375154
NameBDBM50375154
Synonyms:CHEMBL257320
TypeSmall organic molecule
Emp. Form.C28H28N6O3
Mol. Mass.496.5603
SMILESCN1CCN(CC1)c1ccc(Nc2ncc3c(n2)n(cc(C(O)=O)c3=O)-c2ccc3CCCc3c2)cc1