Reaction Details
TargetMacrophage colony-stimulating factor 1 receptor
LigandBDBM50375155
Substrate/Competitorn/a
Meas. Tech.ChEMBL_470263 (CHEMBL950218)
IC50 14±n/a nM
Citation Huang, HHutta, DAHu, HDesJarlais, RLSchubert, CPetrounia, IPChaikin, MAManthey, CLPlayer, MR Design and synthesis of a pyrido[2,3-d]pyrimidin-5-one class of anti-inflammatory FMS inhibitors. Bioorg Med Chem Lett18:2355-61 (2008) 
 
Macrophage colony-stimulating factor 1 receptor
Name:Macrophage colony-stimulating factor 1 receptor
Type:Protein
Mol. Mass.:107979.48
Organism:Homo sapiens (Human)
Description:P07333
Residue:972
BDBM50375155
NameBDBM50375155
Synonyms:CHEMBL256893
TypeSmall organic molecule
Emp. Form.C29H31N7O2
Mol. Mass.509.6021
SMILESCN1CCN(Cc2ccc(Nc3ncc4c(n3)n(cc(C(N)=O)c4=O)-c3ccc4CCCc4c3)cc2)CC1