Reaction Details
TargetMethionine aminopeptidase 1
LigandBDBM50375166
Substrate/Competitorn/a
Meas. Tech.ChEMBL_470290 (CHEMBL951176)
Ki 9000±n/a nM
Citation Haldar, MKScott, MDSule, NSrivastava, DKMallik, S Synthesis of barbiturate-based methionine aminopeptidase-1 inhibitors. Bioorg Med Chem Lett18:2373-6 (2008) 
 
Methionine aminopeptidase 1
Name:Methionine aminopeptidase 1
Type:Enzyme
Mol. Mass.:43220.79
Organism:Homo sapiens (Human)
Description:MetAP1 with an N-terminal six histidine tag was expressed in baculovirus infected sf9 cells.
Residue:386
BDBM50375166
NameBDBM50375166
Synonyms:CHEMBL270142
TypeSmall organic molecule
Emp. Form.C13H10N2O3
Mol. Mass.242.2301
SMILESO=[#6]-1-[#7]-[#6](=O)\[#6](=[#6]\[#6]=[#6]\c2ccccc2)-[#6](=O)-[#7]-1