Reaction Details
TargetLanosterol 14-alpha demethylase
LigandBDBM50375211
Substrate/Competitorn/a
Meas. Tech.ChEMBL_470401 (CHEMBL939288)
Kd 340±n/a nM
Citation Korosec, TAcimovic, JSeliskar, MKocjan, DTacer, KFRozman, DUrleb, U Novel cholesterol biosynthesis inhibitors targeting human lanosterol 14alpha-demethylase (CYP51). Bioorg Med Chem16:209-21 (2008) 
 
Lanosterol 14-alpha demethylase
Name:Lanosterol 14-alpha demethylase
Type:Protein
Mol. Mass.:56817.21
Organism:Homo sapiens (Human)
Description:Q16850
Residue:503
BDBM50375211
NameBDBM50375211
Synonyms:CHEMBL535872
TypeSmall organic molecule
Emp. Form.C22H26N2O
Mol. Mass.334.4546
SMILESCCCN(CCc1ccc2ccccc2c1)CC(O)c1cccnc1