Reaction Details
TargetAldo-keto reductase family 1 member C21
LigandBDBM16314
Substrate/Competitorn/a
Meas. Tech.ChEMBL_470435 (CHEMBL936590)
Ki 22000±n/a nM
Citation Dhagat, UEndo, SHara, AEl-Kabbani, O Inhibition of 3(17)alpha-hydroxysteroid dehydrogenase (AKR1C21) by aldose reductase inhibitors. Bioorg Med Chem16:3245-54 (2008) 
 
Aldo-keto reductase family 1 member C21
Name:Aldo-keto reductase family 1 member C21
Type:PROTEIN
Mol. Mass.:36879.72
Organism:Mus musculus
Description:ChEMBL_470435
Residue:323
BDBM16314
NameBDBM16314
Synonyms:2-{[6-methoxy-5-(trifluoromethyl)naphthalen-1-yl]-N-methylmethanethioamido}acetic acid CHEMBL436 Tolrestat
TypeSmall organic molecule
Emp. Form.C16H14F3NO3S
Mol. Mass.357.347
SMILESCOc1ccc2c(cccc2c1C(F)(F)F)C(=S)N(C)CC(O)=O