Reaction Details
TargetKappa-type opioid receptor
LigandBDBM50375220
Substrate/Competitorn/a
Meas. Tech.ChEMBL_470454 (CHEMBL932681)
Ki 2600±n/a nM
Citation Ma, ZXu, WLiu-Chen, LYLee, DY Novel coumarin glycoside and phenethyl vanillate from Notopterygium forbesii and their binding affinities for opioid and dopamine receptors. Bioorg Med Chem16:3218-23 (2008) 
 
Kappa-type opioid receptor
Name:Kappa-type opioid receptor
Type:G Protein-Coupled Receptor (GPCR)
Mol. Mass.:42648.76
Organism:Homo sapiens (Human)
Description:P41145
Residue:380
BDBM50375220
NameBDBM50375220
Synonyms:ANISOCOUMARIN H
TypeSmall organic molecule
Emp. Form.C19H22O4
Mol. Mass.314.3756
SMILES[#6]\[#6](-[#6])=[#6]\[#6](-[#8])-[#6]\[#6](-[#6])=[#6]\[#6]-[#8]-c1ccc2ccc(=O)oc2c1