Reaction Details
TargetKappa-type opioid receptor
LigandBDBM50071370
Substrate/Competitorn/a
Meas. Tech.ChEMBL_470454 (CHEMBL932681)
Ki 2515±n/a nM
Citation Ma, ZXu, WLiu-Chen, LYLee, DY Novel coumarin glycoside and phenethyl vanillate from Notopterygium forbesii and their binding affinities for opioid and dopamine receptors. Bioorg Med Chem16:3218-23 (2008) 
 
Kappa-type opioid receptor
Name:Kappa-type opioid receptor
Type:G Protein-Coupled Receptor (GPCR)
Mol. Mass.:42648.76
Organism:Homo sapiens (Human)
Description:P41145
Residue:380
BDBM50071370
NameBDBM50071370
Synonyms:(3R,8S)-falcarindiol (3S,8S)-falcarindiol (Z)-(3S,8S)-Heptadeca-1,9-diene-4,6-diyne-3,8-diol Falcarindiol Heptadeca-1,9-diene-4,6-diyne-3,8-diol
TypeSmall organic molecule
Emp. Form.C17H24O2
Mol. Mass.260.3713
SMILESCCCCCCC\C=C/[C@H](O)C#CC#C[C@H](O)C=C