Reaction Details
TargetIsoform 1 of Fibronectin (1)
LigandBDBM50375223
Substrate/Competitorn/a
Meas. Tech.ChEMBL_470457 (CHEMBL951301)
Kd 6.5±n/a nM
Citation Wakao, MSaito, AOhishi, KKishimoto, YNishimura, TSobel, MSuda, Y Sugar Chips immobilized with synthetic sulfated disaccharides of heparin/heparan sulfate partial structure. Bioorg Med Chem Lett18:2499-504 (2008) 
 
Isoform 1 of Fibronectin (1)
Name:Isoform 1 of Fibronectin (1)
Type:PROTEIN
Mol. Mass.:262590.80
Organism:Homo sapiens (Human)
Description:ChEMBL_17040
Residue:2386
BDBM50375223
NameBDBM50375223
Synonyms:CHEMBL404103
TypeSmall organic molecule
Emp. Form.C33H50N3O22S4
Mol. Mass.969.019
SMILESCO[C@@H]1[C@@H](COS([O-])(=O)=O)O[C@H](O[C@H]2[C@H](O)[C@@H](O)[C@H](OC[C@@H](O)[C@@H](O)[C@H](O)[C@@H](O)CNc3cccc(NC(=O)CCCCC4CCSS4)c3)O[C@@H]2C([O-])=O)[C@H](NS([O-])(=O)=O)[C@H]1O