Reaction Details
TargetRAF proto-oncogene serine/threonine-protein kinase
LigandBDBM26041
Substrate/Competitorn/a
Meas. Tech.ChEMBL_470479 (CHEMBL951323)
IC50 1.4±n/a nM
Citation Zhu, TJiao, YChen, YDWang, XLi, HFZhang, LYLu, T Pharmacophore identification of Raf-1 kinase inhibitors. Bioorg Med Chem Lett18:2346-50 (2008) 
 
RAF proto-oncogene serine/threonine-protein kinase
Name:RAF proto-oncogene serine/threonine-protein kinase
Type:Serine/threonine-protein kinase
Mol. Mass.:73082.52
Organism:Homo sapiens (Human)
Description:P04049
Residue:648
BDBM26041
NameBDBM26041
Synonyms:2-chloro-5-(2-phenyl-5-(pyridin-4-yl)-1H-imidazol-4-yl)phenol CHEMBL373011 L-779450
TypeSmall organic molecule
Emp. Form.C20H14ClN3O
Mol. Mass.347.798
SMILESOc1cc(ccc1Cl)-c1[nH]c(nc1-c1ccncc1)-c1ccccc1