Reaction Details
TargetHeparanase
LigandBDBM50375287
Substrate/Competitorn/a
Meas. Tech.ChEMBL_470599 (CHEMBL939421)
Ki 2230±n/a nM
Citation Fairweather, JKHammond, EJohnstone, KDFerro, V Synthesis and heparanase inhibitory activity of sulfated mannooligosaccharides related to the antiangiogenic agent PI-88. Bioorg Med Chem16:699-709 (2008) 
 
Heparanase
Name:Heparanase
Type:PROTEIN
Mol. Mass.:61167.67
Organism:Homo sapiens (Human)
Description:ChEMBL_327900
Residue:543
BDBM50375287
NameBDBM50375287
Synonyms:CHEMBL260220
TypeSmall organic molecule
Emp. Form.C12H14O35S8
Mol. Mass.974.743
SMILES[O-]S(=O)(=O)OC[C@H]1O[C@H](O[C@@H]2C(OS([O-])(=O)=O)O[C@H](COS([O-])(=O)=O)[C@@H](OS([O-])(=O)=O)[C@@H]2OS([O-])(=O)=O)[C@@H](OS([O-])(=O)=O)[C@@H](OS([O-])(=O)=O)[C@@H]1OS([O-])(=O)=O