Reaction Details
TargetHeparanase
LigandBDBM50375289
Substrate/Competitorn/a
Meas. Tech.ChEMBL_470598 (CHEMBL939420)
IC50 250±n/a nM
Citation Fairweather, JKHammond, EJohnstone, KDFerro, V Synthesis and heparanase inhibitory activity of sulfated mannooligosaccharides related to the antiangiogenic agent PI-88. Bioorg Med Chem16:699-709 (2008) 
 
Heparanase
Name:Heparanase
Type:PROTEIN
Mol. Mass.:61167.67
Organism:Homo sapiens (Human)
Description:ChEMBL_327900
Residue:543
BDBM50375289
NameBDBM50375289
Synonyms:CHEMBL258980
TypeSmall organic molecule
Emp. Form.C13H17O32S7
Mol. Mass.909.714
SMILESCO[C@H]1O[C@H](COS([O-])(=O)=O)[C@@H](OS([O-])(=O)=O)[C@H](O[C@H]2O[C@H](COS([O-])(=O)=O)[C@@H](OS([O-])(=O)=O)[C@H](OS([O-])(=O)=O)[C@@H]2OS([O-])(=O)=O)[C@@H]1OS([O-])(=O)=O