Reaction Details
TargetHeparanase
LigandBDBM50375291
Substrate/Competitorn/a
Meas. Tech.ChEMBL_470599 (CHEMBL939421)
Ki 280±n/a nM
Citation Fairweather, JKHammond, EJohnstone, KDFerro, V Synthesis and heparanase inhibitory activity of sulfated mannooligosaccharides related to the antiangiogenic agent PI-88. Bioorg Med Chem16:699-709 (2008) 
 
Heparanase
Name:Heparanase
Type:PROTEIN
Mol. Mass.:61167.67
Organism:Homo sapiens (Human)
Description:ChEMBL_327900
Residue:543
BDBM50375291
NameBDBM50375291
Synonyms:CHEMBL439118
TypeSmall organic molecule
Emp. Form.C30H35O77S17
Mol. Mass.2172.667
SMILES[O-]S(=O)(=O)OC[C@H]1O[C@H](O[C@@H]2C(OS([O-])(=O)=O)O[C@H](COS([O-])(=O)=O)[C@@H](OS([O-])(=O)=O)[C@@H]2OS([O-])(=O)=O)[C@@H](OS([O-])(=O)=O)[C@@H](O[C@H]2O[C@H](COS([O-])(=O)=O)[C@@H](OS([O-])(=O)=O)[C@H](O[C@H]3O[C@H](COS([O-])(=O)=O)[C@@H](OS([O-])(=O)=O)[C@H](OC4O[C@H](COS([O-])(=O)=O)[C@@H](OS([O-])(=O)=O)[C@H](OS([O-])(=O)=O)[C@@H]4OS([O-])(=O)=O)[C@@H]3OS([O-])(=O)=O)[C@@H]2OS([O-])(=O)=O)[C@@H]1OS([O-])(=O)=O