Reaction Details
TargetDNA polymerase beta
LigandBDBM50375301
Substrate/Competitorn/a
Meas. Tech.ChEMBL_470719 (CHEMBL934559)
IC50 11900±n/a nM
Citation Naganuma, MNishida, MKuramochi, KSugawara, FYoshida, HMizushina, Y 1-deoxyrubralactone, a novel specific inhibitor of families X and Y of eukaryotic DNA polymerases from a fungal strain derived from sea algae. Bioorg Med Chem16:2939-44 (2008) 
 
DNA polymerase beta
Name:DNA polymerase beta
Type:PROTEIN
Mol. Mass.:38334.34
Organism:Rattus norvegicus
Description:ChEMBL_1361926
Residue:335
BDBM50375301
NameBDBM50375301
Synonyms:CHEMBL260980
TypeSmall organic molecule
Emp. Form.C14H12O5
Mol. Mass.260.2421
SMILESCOc1cc(O)c2c(c1)c1C(C)CC(=O)c1oc2=O