Reaction Details
TargetLanosterol 14-alpha demethylase
LigandBDBM50375302
Substrate/Competitorn/a
Meas. Tech.ChEMBL_470779 (CHEMBL934981)
IC50 910±n/a nM
Citation Ekins, SMankowski, DCHoover, DJLawton, MPTreadway, JLHarwood, HJ Three-dimensional quantitative structure-activity relationship analysis of human CYP51 inhibitors. Drug Metab Dispos35:493-500 (2007) 
 
Lanosterol 14-alpha demethylase
Name:Lanosterol 14-alpha demethylase
Type:Protein
Mol. Mass.:56817.21
Organism:Homo sapiens (Human)
Description:Q16850
Residue:503
BDBM50375302
NameBDBM50375302
Synonyms:CHEMBL409630
TypeSmall organic molecule
Emp. Form.C23H25N3O3
Mol. Mass.391.4629
SMILESOC1CCN(CC1)C(=O)[C@H](Cc1ccccc1)NC(=O)c1cc2ccccc2[nH]1