Reaction Details
TargetLanosterol 14-alpha demethylase
LigandBDBM20192
Substrate/Competitorn/a
Meas. Tech.ChEMBL_470779 (CHEMBL934981)
IC50>200000±n/a nM
Citation Ekins, SMankowski, DCHoover, DJLawton, MPTreadway, JLHarwood, HJ Three-dimensional quantitative structure-activity relationship analysis of human CYP51 inhibitors. Drug Metab Dispos35:493-500 (2007) 
 
Lanosterol 14-alpha demethylase
Name:Lanosterol 14-alpha demethylase
Type:Protein
Mol. Mass.:56817.21
Organism:Homo sapiens (Human)
Description:Q16850
Residue:503
BDBM20192
NameBDBM20192
Synonyms:(1S,2R,5S,10S,11S,14R,15R)-2,15-dimethyl-14-[(2R)-6-methylheptan-2-yl]tetracyclo[8.7.0.0^{2,7}.0^{11,15}]heptadec-7-en-5-ol | cholesterol
TypeSteroid
Emp. Form.C27H46O
Mol. Mass.386.6535
SMILES[H][C@@]1(CC[C@@]2([H])[C@]3([H])CC=C4C[C@@H](O)CC[C@]4(C)[C@@]3([H])CC[C@]12C)[C@H](C)CCCC(C)C