Reaction Details
TargetLanosterol 14-alpha demethylase
LigandBDBM50375309
Substrate/Competitorn/a
Meas. Tech.ChEMBL_470779 (CHEMBL934981)
IC50>200000±n/a nM
Citation Ekins, SMankowski, DCHoover, DJLawton, MPTreadway, JLHarwood, HJ Three-dimensional quantitative structure-activity relationship analysis of human CYP51 inhibitors. Drug Metab Dispos35:493-500 (2007) 
 
Lanosterol 14-alpha demethylase
Name:Lanosterol 14-alpha demethylase
Type:Protein
Mol. Mass.:56817.21
Organism:Homo sapiens (Human)
Description:Q16850
Residue:509
BDBM50375309
NameBDBM50375309
Synonyms:BAY-5360 Flagyl 375 Flagyl i.v. rtu in plastic container Metric 21 Metro i.v. Metrocream Metrolotion Metromidol
TypeSmall organic molecule
Emp. Form.C6H9N3O3
Mol. Mass.171.154
SMILESCc1ncc(n1CCO)[N+]([O-])=O