Reaction Details
TargetLanosterol 14-alpha demethylase
LigandBDBM50375313
Substrate/Competitorn/a
Meas. Tech.ChEMBL_470779 (CHEMBL934981)
IC50 26000±n/a nM
Citation Ekins, SMankowski, DCHoover, DJLawton, MPTreadway, JLHarwood, HJ Three-dimensional quantitative structure-activity relationship analysis of human CYP51 inhibitors. Drug Metab Dispos35:493-500 (2007) 
 
Lanosterol 14-alpha demethylase
Name:Lanosterol 14-alpha demethylase
Type:Protein
Mol. Mass.:56817.21
Organism:Homo sapiens (Human)
Description:Q16850
Residue:503
BDBM50375313
NameBDBM50375313
Synonyms:CHEMBL261013
TypeSmall organic molecule
Emp. Form.C22H23ClN4O3
Mol. Mass.426.896
SMILESOC1CCN(CC1)C(=O)[C@H](Cc1cccnc1)NC(=O)c1cc2cc(Cl)ccc2[nH]1