Reaction Details
TargetLanosterol 14-alpha demethylase
LigandBDBM50375314
Substrate/Competitorn/a
Meas. Tech.ChEMBL_470779 (CHEMBL934981)
IC50 9700±n/a nM
Citation Ekins, SMankowski, DCHoover, DJLawton, MPTreadway, JLHarwood, HJ Three-dimensional quantitative structure-activity relationship analysis of human CYP51 inhibitors. Drug Metab Dispos35:493-500 (2007) 
 
Lanosterol 14-alpha demethylase
Name:Lanosterol 14-alpha demethylase
Type:Protein
Mol. Mass.:56817.21
Organism:Homo sapiens (Human)
Description:Q16850
Residue:503
BDBM50375314
NameBDBM50375314
Synonyms:CHEMBL410331
TypeSmall organic molecule
Emp. Form.C23H23Cl2N3O3
Mol. Mass.460.353
SMILESOC1CCN(CC1)C(=O)[C@H](Cc1ccc(Cl)cc1)NC(=O)c1cc2cc(Cl)ccc2[nH]1