Reaction Details
Target3-hydroxy-3-methylglutaryl-coenzyme A reductase
LigandBDBM50226161
Substrate/Competitorn/a
Meas. Tech.ChEMBL_470908 (CHEMBL937006)
IC50 1500±n/a nM
Citation Pak, VVKoo, MKim, MJYun, LKwon, DY Binding effect and design of a competitive inhibitory peptide for HMG-CoA reductase through modeling of an active peptide backbone. Bioorg Med Chem16:1309-18 (2008) 
 
3-hydroxy-3-methylglutaryl-coenzyme A reductase
Name:3-hydroxy-3-methylglutaryl-coenzyme A reductase
Type:PROTEIN
Mol. Mass.:96954.46
Organism:Mesocricetus auratus
Description:ChEMBL_470908
Residue:887
BDBM50226161
NameBDBM50226161
Synonyms:CHEMBL261622 | GFPDGG
TypeSmall organic molecule
Emp. Form.C24H32N6O9
Mol. Mass.548.5457
SMILESNCC(=O)N[C@@H](Cc1ccccc1)C(=O)N1CCC[C@H]1C(=O)N[C@@H](CC(O)=O)C(=O)NCC(=O)NCC(O)=O