Reaction Details
Target3-hydroxy-3-methylglutaryl-coenzyme A reductase
LigandBDBM50375321
Substrate/Competitorn/a
Meas. Tech.ChEMBL_470908 (CHEMBL937006)
IC50 97100±n/a nM
Citation Pak, VVKoo, MKim, MJYun, LKwon, DY Binding effect and design of a competitive inhibitory peptide for HMG-CoA reductase through modeling of an active peptide backbone. Bioorg Med Chem16:1309-18 (2008) 
 
3-hydroxy-3-methylglutaryl-coenzyme A reductase
Name:3-hydroxy-3-methylglutaryl-coenzyme A reductase
Type:PROTEIN
Mol. Mass.:96954.46
Organism:Mesocricetus auratus
Description:ChEMBL_470908
Residue:887
BDBM50375321
NameBDBM50375321
Synonyms:CHEMBL261093
TypeSmall organic molecule
Emp. Form.C19H34N4O5
Mol. Mass.398.4971
SMILESCC[C@H](C)[C@H](N)C(=O)N[C@@H](C)C(=O)N[C@@H](C(C)C)C(=O)N1CCC[C@H]1C(O)=O