Reaction Details
TargetInsulin-like growth factor 1 receptor
LigandBDBM50375331
Substrate/Competitorn/a
Meas. Tech.ChEMBL_471114 (CHEMBL921267)
IC50 17±n/a nM
Citation Mulvihill, MJJi, QSCoate, HRCooke, ADong, HFeng, LForeman, KRosenfeld-Franklin, MHonda, AMak, GMulvihill, KMNigro, AIO'Connor, MPirrit, CSteinig, AGSiu, KStolz, KMSun, YTavares, PAYao, YGibson, NW Novel 2-phenylquinolin-7-yl-derived imidazo[1,5-a]pyrazines as potent insulin-like growth factor-I receptor (IGF-IR) inhibitors. Bioorg Med Chem16:1359-75 (2008) 
 
Insulin-like growth factor 1 receptor
Name:Insulin-like growth factor 1 receptor
Type:Protein
Mol. Mass.:154776.79
Organism:Homo sapiens (Human)
Description:P08069
Residue:1367
BDBM50375331
NameBDBM50375331
Synonyms:CHEMBL261253
TypeSmall organic molecule
Emp. Form.C30H30N6O
Mol. Mass.490.5988
SMILESNc1nccn2c(nc(-c3ccc4ccc(nc4c3)-c3ccccc3)c12)[C@H]1C[C@H](CN2CCOCC2)C1