Reaction Details
TargetMAP kinase-activated protein kinase 2
LigandBDBM50336316
Substrate/Competitorn/a
Meas. Tech.ChEMBL_471134 (CHEMBL921287)
IC50>10000±n/a nM
Citation Mulvihill, MJJi, QSCoate, HRCooke, ADong, HFeng, LForeman, KRosenfeld-Franklin, MHonda, AMak, GMulvihill, KMNigro, AIO'Connor, MPirrit, CSteinig, AGSiu, KStolz, KMSun, YTavares, PAYao, YGibson, NW Novel 2-phenylquinolin-7-yl-derived imidazo[1,5-a]pyrazines as potent insulin-like growth factor-I receptor (IGF-IR) inhibitors. Bioorg Med Chem16:1359-75 (2008) 
 
MAP kinase-activated protein kinase 2
Name:MAP kinase-activated protein kinase 2
Type:Serine/threonine-protein kinase
Mol. Mass.:45579.87
Organism:Homo sapiens (Human)
Description:P49137
Residue:400
BDBM50336316
NameBDBM50336316
Synonyms:CHEMBL410659 cis-3-(3-azetidin-1-ylmethylcyclobutyl)-1-(2-phenylquinolin-7-yl)imidazo[1,5-a]pyrazin-8-ylamine
TypeSmall organic molecule
Emp. Form.C29H28N6
Mol. Mass.460.5728
SMILESNc1nccn2c(nc(-c3ccc4ccc(nc4c3)-c3ccccc3)c12)[C@@H]1C[C@H](CN2CCC2)C1