Reaction Details
TargetCytochrome P450 3A4
LigandBDBM50375340
Substrate/Competitorn/a
Meas. Tech.ChEMBL_471117 (CHEMBL921270)
IC50 7800±n/a nM
Citation Mulvihill, MJJi, QSCoate, HRCooke, ADong, HFeng, LForeman, KRosenfeld-Franklin, MHonda, AMak, GMulvihill, KMNigro, AIO'Connor, MPirrit, CSteinig, AGSiu, KStolz, KMSun, YTavares, PAYao, YGibson, NW Novel 2-phenylquinolin-7-yl-derived imidazo[1,5-a]pyrazines as potent insulin-like growth factor-I receptor (IGF-IR) inhibitors. Bioorg Med Chem16:1359-75 (2008) 
 
Cytochrome P450 3A4
Name:Cytochrome P450 3A4
Type:Enzyme
Mol. Mass.:57349.57
Organism:Homo sapiens (Human)
Description:n/a
Residue:503
BDBM50375340
NameBDBM50375340
Synonyms:CHEMBL258951
TypeSmall organic molecule
Emp. Form.C29H28N6S
Mol. Mass.492.638
SMILESNc1nccn2c(nc(-c3ccc4ccc(nc4c3)-c3ccccc3)c12)[C@@H]1C[C@@H](C1)N1CCSCC1