Reaction Details
TargetThyroid hormone receptor alpha
LigandBDBM50375342
Substrate/Competitorn/a
Meas. Tech.ChEMBL_471200 (CHEMBL939179)
Kd 43±n/a nM
Citation Ocasio, CAScanlan, TS Characterization of thyroid hormone receptor alpha (TRalpha)-specific analogs with varying inner- and outer-ring substituents. Bioorg Med Chem16:762-70 (2008) 
 
Thyroid hormone receptor alpha
Name:Thyroid hormone receptor alpha
Type:Receptor
Mol. Mass.:54818.00
Organism:Homo sapiens (Human)
Description:Recombinant hThR was obtained from nuclear extracts from SF9 cells infected with baculovirus vectors encoding for ThRalpha 1.
Residue:490
BDBM50375342
NameBDBM50375342
Synonyms:CHEMBL258886
TypeSmall organic molecule
Emp. Form.C16H11BrI2N2O4
Mol. Mass.628.982
SMILESOc1[nH]c(=O)[nH]c1Cc1cc(I)c(Oc2ccc(O)c(Br)c2)c(I)c1