Reaction Details
TargetPotassium voltage-gated channel subfamily H member 2
LigandBDBM50321777
Substrate/Competitorn/a
Meas. Tech.ChEMBL_471260 (CHEMBL922329)
IC50 0.41±n/a nM
Citation Schläger, TSchepmann, DWürthwein, EUWünsch, B Synthesis and structure-affinity relationships of novel spirocyclic sigma receptor ligands with furopyrazole structure. Bioorg Med Chem16:2992-3001 (2008) 
 
Potassium voltage-gated channel subfamily H member 2
Name:Potassium voltage-gated channel subfamily H member 2
Type:Multi-pass membrane protein
Mol. Mass.:126672.65
Organism:Homo sapiens (Human)
Description:Q12809
Residue:1159
BDBM50321777
NameBDBM50321777
Synonyms:(R)-1'-benzyl-6-methoxy-1-phenyl-1,6-dihydrospiro[furo[3,4-c]pyrazole-4,4'-piperidine] | CHEMBL1172689
TypeSmall organic molecule
Emp. Form.C23H25N3O2
Mol. Mass.375.4635
SMILESCO[C@@H]1OC2(CCN(Cc3ccccc3)CC2)c2cnn(c12)-c1ccccc1