Reaction Details
TargetCruzipain
LigandBDBM50108838
Substrate/Competitorn/a
Meas. Tech.ChEMBL_471525 (CHEMBL938460)
Ki 22±n/a nM
Citation Freitas, RFOprea, TIMontanari, CA 2D QSAR and similarity studies on cruzain inhibitors aimed at improving selectivity over cathepsin L. Bioorg Med Chem16:838-53 (2008) 
 
Cruzipain
Name:Cruzipain
Type:Protein
Mol. Mass.:49831.41
Organism:Trypanosoma cruzi
Description:P25779
Residue:467
BDBM50108838
NameBDBM50108838
Synonyms:CHEMBL346190 {1-[1-Benzyl-3-(4-tert-butyl-benzylsulfanyl)-2-oxo-propylcarbamoyl]-2-phenyl-ethyl}-carbamic acid benzyl ester
TypeSmall organic molecule
Emp. Form.C38H42N2O4S
Mol. Mass.622.816
SMILESCC(C)(C)c1ccc(CSCC(=O)[C@H](Cc2ccccc2)NC(=O)[C@H](Cc2ccccc2)NC(=O)OCc2ccccc2)cc1