Reaction Details
TargetCruzipain
LigandBDBM50108840
Substrate/Competitorn/a
Meas. Tech.ChEMBL_471525 (CHEMBL938460)
Ki 2.9±n/a nM
Citation Freitas, RFOprea, TIMontanari, CA 2D QSAR and similarity studies on cruzain inhibitors aimed at improving selectivity over cathepsin L. Bioorg Med Chem16:838-53 (2008) 
 
Cruzipain
Name:Cruzipain
Type:Protein
Mol. Mass.:49831.41
Organism:Trypanosoma cruzi
Description:P25779
Residue:467
BDBM50108840
NameBDBM50108840
Synonyms:3-[3-(2-Benzyloxycarbonylamino-3-phenyl-propionylamino)-2-oxo-4-phenyl-butylsulfanyl]-propionic acid ethyl ester ethyl 3-((S)-3-((S)-2-(benzyloxycarbonyl)-3-phenylpropanamido)-2-oxo-4-phenylbutylthio)propanoate
TypeSmall organic molecule
Emp. Form.C32H36N2O6S
Mol. Mass.576.703
SMILESCCOC(=O)CCSCC(=O)[C@H](Cc1ccccc1)NC(=O)[C@H](Cc1ccccc1)NC(=O)OCc1ccccc1