Reaction Details
TargetProto-oncogene tyrosine-protein kinase Src
LigandBDBM50375360
Substrate/Competitorn/a
Meas. Tech.ChEMBL_471526 (CHEMBL938461)
IC50 5±n/a nM
Citation Mukaiyama, HNishimura, TKobayashi, SKomatsu, YKikuchi, SOzawa, TKamada, NOhnota, H Novel pyrazolo[1,5-a]pyrimidines as c-Src kinase inhibitors that reduce IKr channel blockade. Bioorg Med Chem16:909-21 (2008) 
 
Proto-oncogene tyrosine-protein kinase Src
Name:Proto-oncogene tyrosine-protein kinase Src
Type:Protein
Mol. Mass.:59838.60
Organism:Homo sapiens (Human)
Description:P12931
Residue:536
BDBM50375360
NameBDBM50375360
Synonyms:CHEMBL261188
TypeSmall organic molecule
Emp. Form.C26H29N7O4
Mol. Mass.503.553
SMILESCOc1cc(Nc2nn3c(N[C@H](CO)Cc4cccnc4)cc(nc3c2C(N)=O)C2CC2)cc(OC)c1