Reaction Details
TargetTyrosine-protein kinase Lck
LigandBDBM50375355
Substrate/Competitorn/a
Meas. Tech.ChEMBL_471539 (CHEMBL938474)
IC50 7±n/a nM
Citation Mukaiyama, HNishimura, TKobayashi, SKomatsu, YKikuchi, SOzawa, TKamada, NOhnota, H Novel pyrazolo[1,5-a]pyrimidines as c-Src kinase inhibitors that reduce IKr channel blockade. Bioorg Med Chem16:909-21 (2008) 
 
Tyrosine-protein kinase Lck
Name:Tyrosine-protein kinase Lck
Type:n/a
Mol. Mass.:57987.83
Organism:Homo sapiens (Human)
Description:P06239
Residue:509
BDBM50375355
NameBDBM50375355
Synonyms:CHEMBL260861
TypeSmall organic molecule
Emp. Form.C27H30N6O4
Mol. Mass.502.5649
SMILESCOc1cc(Nc2nn3c(N[C@H](CO)Cc4ccccc4)cc(nc3c2C(N)=O)C2CC2)cc(OC)c1