Reaction Details
TargetHistamine H3 receptor
LigandBDBM50060582
Substrate/Competitorn/a
Meas. Tech.ChEMBL_471591 (CHEMBL940222)
IC50 820±n/a nM
Citation Bembenek, SDKeith, JMLetavic, MAApodaca, RBarbier, AJDvorak, LAluisio, LMiller, KLLovenberg, TWCarruthers, NI Lead identification of acetylcholinesterase inhibitors-histamine H3 receptor antagonists from molecular modeling. Bioorg Med Chem16:2968-73 (2008) 
 
Histamine H3 receptor
Name:Histamine H3 receptor
Type:G Protein-Coupled Receptor (GPCR)
Mol. Mass.:48691.47
Organism:Homo sapiens (Human)
Description:Binding assays were using CHO cells stably expressing hH3R receptors.
Residue:445
BDBM50060582
NameBDBM50060582
Synonyms:1,10-Bis(trimethyl ammonium)decane dibromide CHEMBL1134 DECAMETHONIUM BROMIDE N,N,N'',N''-Tetramethyl-decane-1,10-diammonium; dibromide Syncurine | decane-1,10-bis(trimethylammonium bromide)
TypeSmall organic molecule
Emp. Form.C16H38N2
Mol. Mass.258.4852
SMILESC[N+](C)(C)CCCCCCCCCC[N+](C)(C)C