Reaction Details
TargetDelta-type opioid receptor
LigandBDBM50375379
Substrate/Competitorn/a
Meas. Tech.ChEMBL_471596 (CHEMBL940227)
Ki 740±n/a nM
Citation Jung, BEnglberger, WFröhlich, RSchepmann, DLehmkuhl, KWünsch, B Synthesis and pharmacological evaluation of bicyclic SNC80 analogues with separated benzhydryl moiety. Bioorg Med Chem16:2870-85 (2008) 
 
Delta-type opioid receptor
Name:Delta-type opioid receptor
Type:G Protein-Coupled Receptor (GPCR)
Mol. Mass.:40382.98
Organism:Homo sapiens (Human)
Description:Competition binding assays were carried out using membrane preparations from transfected HN9.10 cells that constitutively expressed the delta opioid receptor.
Residue:372
BDBM50375379
NameBDBM50375379
Synonyms:CHEMBL260519
TypeSmall organic molecule
Emp. Form.C28H35N3O
Mol. Mass.429.597
SMILESCCN(CC)C(=O)c1ccc(CN2C[C@H]3CC=C([C@@H]2CN3CC=C)c2ccccc2)cc1