Reaction Details
TargetMu-type opioid receptor
LigandBDBM50375378
Substrate/Competitorn/a
Meas. Tech.ChEMBL_471597 (CHEMBL940228)
Ki 7300±n/a nM
Citation Jung, BEnglberger, WFröhlich, RSchepmann, DLehmkuhl, KWünsch, B Synthesis and pharmacological evaluation of bicyclic SNC80 analogues with separated benzhydryl moiety. Bioorg Med Chem16:2870-85 (2008) 
 
Mu-type opioid receptor
Name:Mu-type opioid receptor
Type:G Protein-Coupled Receptor (GPCR)
Mol. Mass.:44789.51
Organism:Homo sapiens (Human)
Description:P35372
Residue:400
BDBM50375378
NameBDBM50375378
Synonyms:CHEMBL258791
TypeSmall organic molecule
Emp. Form.C28H37N3O
Mol. Mass.431.6129
SMILESCCN(CC)C(=O)c1ccc(CN2C[C@@H]3CC[C@H]([C@H]2CN3CC=C)c2ccccc2)cc1