Reaction Details
TargetCannabinoid receptor 2
LigandBDBM50375381
Substrate/Competitorn/a
Meas. Tech.ChEMBL_471723 (CHEMBL920995)
IC50 11±n/a nM
Citation Ohta, HIshizaka, TTatsuzuki, MYoshinaga, MIida, IYamaguchi, TTomishima, YFutaki, NToda, YSaito, S Imine derivatives as new potent and selective CB2 cannabinoid receptor agonists with an analgesic action. Bioorg Med Chem16:1111-24 (2008) 
 
Cannabinoid receptor 2
Name:Cannabinoid receptor 2
Type:G Protein-Coupled Receptor (GPCR)
Mol. Mass.:39690.94
Organism:Homo sapiens (Human)
Description:P34972
Residue:360
BDBM50375381
NameBDBM50375381
Synonyms:CHEMBL272754
TypeSmall organic molecule
Emp. Form.C21H26F3N3O
Mol. Mass.393.4458
SMILESCc1c(cccc1C(F)(F)F)C(=O)N=c1cc(n(C)n1CC1CC1)C(C)(C)C