Reaction Details
TargetCannabinoid receptor 1
LigandBDBM50375385
Substrate/Competitorn/a
Meas. Tech.ChEMBL_471724 (CHEMBL920996)
IC50 940±n/a nM
Citation Ohta, HIshizaka, TTatsuzuki, MYoshinaga, MIida, IYamaguchi, TTomishima, YFutaki, NToda, YSaito, S Imine derivatives as new potent and selective CB2 cannabinoid receptor agonists with an analgesic action. Bioorg Med Chem16:1111-24 (2008) 
 
Cannabinoid receptor 1
Name:Cannabinoid receptor 1
Type:G Protein-Coupled Receptor (GPCR)
Mol. Mass.:52868.96
Organism:Homo sapiens (Human)
Description:P21554
Residue:472
BDBM50375385
NameBDBM50375385
Synonyms:CHEMBL264154
TypeSmall organic molecule
Emp. Form.C21H25F4N3O
Mol. Mass.411.4363
SMILESCn1c(c\c(=N/C(=O)c2cccc(c2F)C(F)(F)F)n1CC1CCC1)C(C)(C)C