Reaction Details
TargetCannabinoid receptor 2
LigandBDBM50375382
Substrate/Competitorn/a
Meas. Tech.ChEMBL_471723 (CHEMBL920995)
IC50 2.9±n/a nM
Citation Ohta, HIshizaka, TTatsuzuki, MYoshinaga, MIida, IYamaguchi, TTomishima, YFutaki, NToda, YSaito, S Imine derivatives as new potent and selective CB2 cannabinoid receptor agonists with an analgesic action. Bioorg Med Chem16:1111-24 (2008) 
 
Cannabinoid receptor 2
Name:Cannabinoid receptor 2
Type:G Protein-Coupled Receptor (GPCR)
Mol. Mass.:39690.94
Organism:Homo sapiens (Human)
Description:P34972
Residue:360
BDBM50375382
NameBDBM50375382
Synonyms:CHEMBL410014
TypeSmall organic molecule
Emp. Form.C20H23F4N3O
Mol. Mass.397.4097
SMILESCn1c(c\c(=N/C(=O)c2cccc(c2F)C(F)(F)F)n1CC1CC1)C(C)(C)C