Reaction Details
TargetAdenosine receptor A2b
LigandBDBM50375416
Substrate/Competitorn/a
Meas. Tech.ChEMBL_471789 (CHEMBL939997)
Ki 3.0±n/a nM
Citation Stefanachi, ABrea, JMCadavid, MICenteno, NBEsteve, CLoza, MIMartinez, ANieto, RRaviña, ESanz, FSegarra, VSotelo, EVidal, BCarotti, A 1-, 3- and 8-substituted-9-deazaxanthines as potent and selective antagonists at the human A2B adenosine receptor. Bioorg Med Chem16:2852-69 (2008) 
 
Adenosine receptor A2b
Name:Adenosine receptor A2b
Type:G Protein-Coupled Receptor (GPCR)
Mol. Mass.:36341.22
Organism:Homo sapiens (Human)
Description:n/a
Residue:332
BDBM50375416
NameBDBM50375416
Synonyms:CHEMBL260693
TypeSmall organic molecule
Emp. Form.C26H26ClN5O4
Mol. Mass.507.969
SMILESCn1c2cc([nH]c2c(=O)n(C)c1=O)-c1ccc(OCC(=O)N2CCN(CC2)c2cccc(Cl)c2)cc1